approvedBy
type: DatatypeProperty
comment: The subject has been approved by object.
range: Literal

articleName
type: DatatypeProperty
comment: Uses a non-controlled vocabulary to describe the intended semantic relationship between the Subject node, and the node in which the Subject is associated through a HAS or HASA relationship.
range: Literal

authoritative
type: DatatypeProperty
comment: The object states whether the subject is authoritative.
range: Literal

componentName
type: DatatypeProperty
comment: The subject is known to be named object.
range: Literal

datatype
type: DatatypeProperty
comment: Idiomatic property used for structured values.
range: Literal

default_value
type: DatatypeProperty
comment: The subject has a default value of object.
range: Literal

enum
type: DatatypeProperty
comment: The subject may assume the value of object.
range: Literal

max
type: DatatypeProperty
comment: The subject has a maximum value of object.
range: Literal

min
type: DatatypeProperty
comment: The subject has a minimum value of object.
range: Literal

ofType
type: DatatypeProperty
comment: The subject is of primitive type object.
range: Literal

sampleInputData
type: DatatypeProperty
comment: Object is a sample of valid input that subject can handle.
range: Literal

sampleOutputData
type: DatatypeProperty
comment: Object is a sample of valid output created by running the subject.
range: Literal

signatureURL
type: DatatypeProperty
comment: Object is a URL that contains information on the subject.
range: Literal

has
type: ObjectProperty
comment: The subject contains one or more object.

hasa
type: ObjectProperty
comment: The subject contains exactly one object.